Foros del Web » Programando para Internet » PHP »

Error de Compilacion de PHP 4.2.1 con Apache 2.0

Estas en el tema de Error de Compilacion de PHP 4.2.1 con Apache 2.0 en el foro de PHP en Foros del Web. el error es el siguiente: Código: -g -O2 -pthread -DZTS -prefer-pic -c php_functions.c php_functions.c:93:27: missing binary operator before '!' make[3]: *** [php_functions.lo] Error 1 make[3]: ...
  #1 (permalink)  
Antiguo 19/07/2002, 19:09
 
Fecha de Ingreso: mayo-2002
Mensajes: 106
Antigüedad: 15 años, 6 meses
Puntos: 0
Error de Compilacion de PHP 4.2.1 con Apache 2.0

el error es el siguiente:
Código:
 -g -O2 -pthread -DZTS -prefer-pic  -c php_functions.c
php_functions.c:93:27: missing binary operator before '!'
make[3]: *** [php_functions.lo] Error 1
make[3]: Leaving directory `/usr/local/etc/php-4.2.1/sapi/apache2filter'
make[2]: *** [all-recursive] Error 1
make[2]: Leaving directory `/usr/local/etc/php-4.2.1/sapi/apache2filter'
make[1]: *** [all-recursive] Error 1
make[1]: Leaving directory `/usr/local/etc/php-4.2.1/sapi'
make: *** [all-recursive] Error 1
Lo trate de arreglar con --enable-so pero nomas no..
Sugerencias??..

Senso
<hr>
Vivir para ser libres y bailar ska para ser felices.
Atención: Estás leyendo un tema que no tiene actividad desde hace más de 6 MESES, te recomendamos abrir un Nuevo tema en lugar de responder al actual.
Respuesta




La zona horaria es GMT -6. Ahora son las 02:20.